{"text_format":"1","workbook":"xlsx","n_sheets":4,"sheets":["DISCLAIMER","TL-System","TL-Parameters","Supplement"],"not_rendered":{"charts":2,"images":31,"macros":1,"external_links":0,"defined_names":62,"comments":4,"pivot_tables":0},"unopened":[],"bounds":{"document_bytes":16777216,"sheet_cells":100000,"rows_first":2000,"rows_last":500,"rows_between":2000,"halvings":0,"cell_chars":16384,"cell_head_chars":4096},"cells_cut":0,"cells_raw":0,"read":"whole","date_system":"1900"}

{"sheet":"DISCLAIMER","index":0,"n_rows":20,"n_cols":4,"rows_kept":20,"cut":false,"hidden":false,"merged":[[28,1,28,3],[3,0,3,1],[5,1,5,3],[4,1,4,3],[8,1,8,3],[7,1,7,3],[9,1,9,3]]}
[]
[]
[]
[]
[null,"RF-Feedline System Loss Calculator (Transducer Power Loss)"]
[]
[]
[null,"TLine Loss Calc is a Spreadsheet Workbook tool (shareware) for the computation"]
[null,"of Losses in RF-Feedline Systems with Transmission Lines"]
[null,"of real or complex Characteristic Impedance."]
[]
[]
[null,null,"Disclaimer"]
[null,null,"The user of this software assumes all responsibility for\napplying the software and for any utilization of the results obtained."]
[]
[null,null,"Comments, Error-Reports or Suggestions for improving the tool are welcome at"]
[null,null,"info@rfclb.space"]
[]
[]
[null,null,null,"© Copyright 2021-2023 – All rights reserved.  "]
{"$rows_left_out":1}
{"sheet":"TL-System","index":1,"n_rows":157,"n_cols":19,"rows_kept":157,"cut":false,"hidden":false,"merged":[[5,7,8,7],[71,1,71,2],[70,1,70,3],[69,1,69,2],[68,1,68,3],[57,1,57,3],[50,6,52,19],[45,18,45,19],[49,1,49,3],[52,1,52,3],[55,1,55,3],[54,1,54,3],[53,1,53,2],[56,1,56,2],[60,1,60,3],[50,1,50,2],[73,1,73,2],[72,1,72,3],[58,10,58,11],[71,6,71,19],[73,13,74,13],[70,18,70,19],[69,18,69,19],[65,1,65,4],[63,1,63,2],[67,1,67,2],[66,1,66,3],[64,1,64,4],[61,1,61,3],[58,1,58,3],[59,1,59,3],[62,1,62,3],[51,1,51,3],[24,1,24,3],[17,1,17,3],[21,1,21,4],[22,1,22,3],[23,1,23,3],[20,1,20,4],[26,1,26,3],[25,1,25,2],[48,1,48,3],[36,1,36,3],[31,1,31,2],[32,1,32,2],[30,1,30,2],[38,1,38,3],[33,1,33,3],[11,16,11,17],[16,1,16,4],[13,1,13,3],[14,1,15,1],[18,1,19,1],[25,17,26,19],[27,17,27,19],[47,18,47,19],[40,1,40,3],[46,1,46,3],[46,6,47,10],[22,6,45,10],[41,1,41,2],[34,1,34,3],[28,1,28,3],[37,1,37,3],[29,1,29,3],[47,1,47,2],[27,1,27,3],[43,1,43,2],[28,17,28,19],[0,1,0,19],[10,2,10,3],[21,10,21,12],[11,2,11,3],[1,1,2,20],[5,1,5,3],[6,1,7,1],[10,16,10,17],[8,16,9,17],[7,16,7,17],[8,1,8,4],[9,1,9,4],[12,2,12,3],[13,16,13,17],[12,16,12,17],[11,5,14,5],[45,1,45,3],[35,1,35,3],[39,1,39,3],[42,1,42,2],[44,1,44,3]]}
[]
[null,"RF-Feedline System Loss Calculator (Transducer Power Loss)"]
[]
[null,null,null,null,null,null,null,null,null,null,null,null,null,null,null,null,null,""]
[null,null,null,null,null,null,null,null,null,null,null,null,null,null,null,null,null,""]
[null,{"$f":"IF(Network_In,\"            SOURCE  +  2-Port NETWORK\",\n               \"     SOURCE\"\n   )","v":"     SOURCE"},null,null,{"$f":"IF(OR(NOT(ISNUMBER(E32)),NOT(ISNUMBER(E33))),\"\",\n   IF(AND(ABS(E7-E15)<0.0001,ABS(E8-E16)<0.0001,ABS(E7-E32)<0.0001,ABS(E8+E33)<0.0001),\"CCM, Γs=0\",\n                                                                                       IF(AND(ABS(E7-E15)<0.0001,ABS(E8-E16)<0.0001),\"Γs=0\",\n                                                                                                                                     IF(AND(ABS(E7-E32)<0.0001,ABS(E8+E33)<0.0001),\"CCM\",\n                                                                                                                                                                                   IF(AND(Supplement!H41=5,E16<>0),\"≈ CCM\",\n                                                                                                                                                                                                                   \"\"\n                                                                                                                                                                                     )\n                                                                                                                                       )\n                                                                                         )\n     )\n   )","v":""},null,null,"Read Me\nFirst !"]
[null,"Zs","SOURCE IMPEDANCE, seen from TL, real, Rs","Ω  ",50]
[null,null,"SOURCE IMPEDANCE, seen from TL, imag, Xs","jΩ  ",0,null,null,null,null,null,null,null,null,null,null,null,"System"]
[null,null,null,null,null,null,null,null,null,null,null,null,null,null,null,null,"P2/Pmax:"]
[null,"TRANSMISSION LINE (TL)    "]
[null,null," PHYSICAL LENGTH,  l         feet ",null,40,null,null,null,null,null,null,null,null,null,null,null,{"$f":"IF(ISNUMBER(E64),ROUND(-E64,2)&\" dB\",\n                  \"< -100 dB\"\n   )","v":"-2.05 dB"}]
[null,null," RF-FREQUENCY, f              MHz ",null,3.5,{"$f":"Supplement!H47","v":1},null,null,null,null,null,null,null,null,null,null,{"$f":"IF(ISNUMBER(E64),\"≡ \"&ROUND(100*10^(-0.1*E64),2)&\" %\",\n                  \"0 %\"\n   )","v":"≡ 62.34 %"}]
[null,null," ATTENUATION, α          dB/100ft ",null,0.53800000000000003,null,null,null,null,null,null,null,null,null,null,null,"U2/U1 :"]
[null,"VELOCITY FACTOR, VF              ",null,null,0.80200000000000005,null,null,null,null,null,null,null,null,null,null,null,{"$f":"IF(AND(SUMSQ((1+E23),E24)>0,SUMSQ((1+E28),E29)=0),\">100 dB\",\n                                                   IF(AND(SUMSQ((1+E23),E24)=0,SUMSQ((1+E28),E29)>0),0,\n                                                                                                     IF(AND(SUMSQ((1+E23),E24)=0,SUMSQ((1+E28),E29)=0),\"0/0\",\n                                                                                                                                                       IF(E47=0,\"<-100 dB\",\n                                                                                                                                                                ROUND(20*LOG10(SQRT(E47*SUMSQ((1+E23),E24)/SUMSQ((1+E28),E29))),2)&\" dB ,\"\n                                                                                                                                                         )\n                                                                                                       )\n                                                     )\n   )","v":"0.82 dB ,"}]
[null,"Zo",{"$f":"\"CHARACTERISTIC IMPEDANCE, real,  Rₒ\"","v":"CHARACTERISTIC IMPEDANCE, real,  Rₒ"},"Ω  ",50,null,null,null,null,null,null,null,null,null,null,null,{"$f":"IF(OR(Q14=\">100 dB\",Q14=0,Q14=\"0/0\",Q14=\"<-100 dB\"),\"n/a\",\n                                                     MOD(ROUND(MOD((-Beta_rad_per_m*Length_in_m + (IF(E24<0,2*PI(),0)+ATAN2((1+E23),E24))) - (IF(E29<0,2*PI(),0)+ATAN2((1+E28),E29)),-2*PI())/(2*PI()),11),-1)\n   )","v":-5.0606776649999997E-2},{"$f":"IF(OR(Q14=\">100 dB\",Q14=0,Q14=\"0/0\",Q14=\"<-100 dB\"),\"\",\n                                                     \"* 360ᵅ\"\n   )","v":"* 360ᵅ"}]
[null,null,{"$f":"IF(Supplement!H44>999.999,\"CHARACTERISTIC IMPEDANCE, imag,  Xₒ\",\n                           \"CHARACTERISTIC IMPEDANCE, imag, |Xₒ|\"&IF(OR(Alpha_Np_per_m=0,Beta_rad_per_m=0),\"=\",\"≤\")&ROUNDDOWN(Supplement!H44,3)&\" Ω\"\n   )","v":"CHARACTERISTIC IMPEDANCE, imag, |Xₒ|≤1.11 Ω"},"jΩ  ",-1.1000000000000001]
[]
[null,{"$f":"IF(Network_Out,\"          2-Port NETWORK  +  LOAD\",\n                \"    LOAD\"\n   )","v":"    LOAD"},null,null,{"$f":"IF(AND(ABS(E15-E19)<0.0001,ABS(E16-E20)<0.0001,ABS(E19-E43)<0.0001,ABS(E20+E44)<0.0001),\"CCM, SWR=1:1\",\n                                                                                         IF(AND(ABS(E15-E19)<0.0001,ABS(E16-E20)<0.0001),\"SWR=1:1\",\n                                                                                                                                         IF(AND(ABS(E19-E43)<0.0001,ABS(E20+E44)<0.0001),\"CCM\",\n                                                                                                                                                                                         IF(AND(Supplement!H41=5,E16<>0),\"≈ CCM\",\n                                                                                                                                                                                                                         \"\"\n                                                                                                                                                                                           )\n                                                                                                                                           )\n                                                                                           )\n   )","v":""},null,null," "]
[null,"ZL","LOAD IMPEDANCE, seen from TL, real, RL","Ω  ",50]
[null,null,"LOAD IMPEDANCE, seen from TL, imag, XL","jΩ  ",75]
{"$rows_left_out":138}
{"sheet":"TL-Parameters","index":2,"n_rows":32,"n_cols":12,"rows_kept":32,"cut":false,"hidden":false,"merged":[[26,1,26,4],[27,1,27,4],[18,1,24,1],[25,5,25,6],[24,5,24,6],[20,4,21,4],[18,5,18,6],[19,5,19,6],[17,10,17,11],[1,1,1,11],[15,7,15,11],[17,7,17,8],[7,7,7,8],[3,7,3,11],[4,7,4,11],[9,7,10,10],[3,1,3,4],[4,1,4,4],[7,2,7,3],[11,7,11,8],[5,1,5,3],[16,1,17,1],[6,2,6,3],[8,1,8,3],[19,7,19,9],[18,7,18,8],[9,1,10,1],[15,1,15,4],[11,1,11,3],[12,1,13,1],[14,2,14,4],[20,10,20,11],[39,5,39,6],[40,5,40,6],[35,5,35,6],[36,5,36,6],[23,5,23,6],[22,5,22,6],[21,5,21,6],[20,5,20,6],[20,7,20,8],[49,5,49,6],[46,5,46,6],[5,7,5,9],[41,5,41,6],[42,5,42,6],[8,7,8,8],[6,7,6,8],[16,5,16,6],[45,5,45,6],[47,5,47,6],[14,7,14,11],[15,5,15,6],[16,7,16,11],[17,5,17,6],[18,10,18,11],[19,10,19,11]]}
[]
[null,"Transmission Line Characteristics obtained from Measurements"]
[]
[null,"Transmission Line (TL) Characteristics obtained",null,null,null,null,null,"Conversion Tool"]
[null,"from two Input-Impedance Measurements of TL with cable-end shorted/opened",null,null,null,null,null,"s11 (50Ω) measured  →  Z = Rin + jXin"]
[null,{"$f":"\"Transmission Line (TL)\"","v":"Transmission Line (TL)"},null,null,null,null,null,"   |s11|=ρ=|Γin|, abs",null,null,0.89400000000000002]
[null,null," PHYSICAL LENGTH, l          feet ",null,100,null,null,"s11, angle φ",null,"deg ",-139.31,{"$f":"IF(AND(ABS(K7)>=45,ABS(K7)<=135),1,0)","v":0}]
[null,null," RF-FREQUENCY, f              MHz ",null,3.5,null,"1 & 2","Real(Z), Rin                  ",null,"Ω ",{"$f":"IF(AND(K6=1,K7=0),\"infinite\",\n                   50*IMREAL(IMDIV(COMPLEX(1+K6*COS(RADIANS(K7)),K6*SIN(RADIANS(K7))),\n                                   COMPLEX(1-K6*COS(RADIANS(K7)),-K6*SIN(RADIANS(K7)))\n                                  )\n                            )\n   )","v":3.1816963419214002}]
[null,{"$f":"\"TL with cable-end shorted\"","v":"TL with cable-end shorted"},null,null,null,null,null,"Imag(Z), Xin",null,"jΩ ",{"$f":"IF(AND(K6=1,K7=0),\"infinite\",\n                   50*IMAGINARY(IMDIV(COMPLEX(1+K6*COS(RADIANS(K7)),K6*SIN(RADIANS(K7))),\n                                      COMPLEX(1-K6*COS(RADIANS(K7)),-K6*SIN(RADIANS(K7)))\n                                     )\n                               )\n   )","v":-18.474189779103849}]
[null,"Zshort","TL INPUT IMPEDANCE, Real(Zin), Rin","Ω ",3.5,1]
[null,null,"TL INPUT IMPEDANCE, Imag(Zin), Xin","jΩ ",-18.474189779103849]
[null,{"$f":"\"TL with cable-end opened\"","v":"TL with cable-end opened"},null,null,null,null,null,"  RETURN LOSS, RL",null,"dB ",{"$f":"IF(K6>0,-20*LOG10(K6),\n         \"infinite\"\n   )","v":0.97324962408164639}]
[null,"Zopen","TL INPUT IMPEDANCE, Real(Zin), Rin","Ω ",29.95,2]
[null,null,"TL INPUT IMPEDANCE, Imag(Zin), Xin","jΩ ",136.38]
[null,"Read Me",null,null,null,null,null,"Transmission Line Attenuation, obtained from"]
[null,{"$f":"\"RESULTS: TL-Parameter Values at \"&ROUND(E8,2)&\"MHz\"","v":"RESULTS: TL-Parameter Values at 3.5MHz"},null,null,null,null,null,"measured Return Loss for Line Shorted/Opened"]
[null,"Zo"," CHARACTERISTIC IMPEDANCE, Real(Zₒ), Rₒ","Ω ",{"$f":"IMREAL(IMSQRT(IMPRODUCT(COMPLEX(E10,E11),COMPLEX(E13,E14))))","v":51.233628760439998}]
[null,null," CHARACTERISTIC IMPEDANCE, Imag(Zₒ), Xₒ ","jΩ ",{"$f":"ROUND(IMAGINARY(IMSQRT(IMPRODUCT(COMPLEX(E10,E11),COMPLEX(E13,E14)))),12)","v":-0.74142692721799996},null,null," RETURN LOSS, RL",null,"dB ",0.97324962408164639]
[null,"γ"," MATCHED LINE LOSS, ATTENUATION, α",{"$f":"CHOOSE(MATCH(C7,Supplement!G84:G85,0),\"dB/100m \",\"dB/100ft \")","v":"dB/100ft "},{"$f":"IF(ISNUMBER(F19),F19*(8.686*(100/E7)),\"\")","v":0.56596814123193351},{"$f":"IFERROR(0.5*IMREAL(IMSUB(IMLN(IMSUM(COMPLEX(1,0),IMSQRT(IMDIV(COMPLEX(E10,E11),\n                                                               COMPLEX(E13,E14)\n                                                              )\n                                                        )\n                                    )\n                              ),\n                          IMLN(IMSUB(COMPLEX(1,0),IMSQRT(IMDIV(COMPLEX(E10,E11),\n                                                               COMPLEX(E13,E14)\n                                                              )\n                                                        )\n                                    )\n                              )\n                         )\n                   ),\n         \"\"\n        )","v":6.5158662356888497E-2},null," ATTENUATION, a",null,"dB ",{"$f":"8.686*K18/(40*LOG10(EXP(1)))","v":0.48663099504084922}]
[null,null," VELOCITY FACTOR, VF (principal value   #0)",null,{"$f":"IFERROR(F22/(F21+(IF(F22<F21,0,ROUNDUP((F22-F21)/PI(),0))+0)*PI()),\"\")","v":0.79996553348892974},{"$f":"IFERROR(0.5*IMAGINARY(IMSUB(IMLN(IMSUM(COMPLEX(1,0),IMSQRT(IMDIV(COMPLEX(E10,E11),\n                                                                  COMPLEX(E13,E14)\n                                                                 )\n                                                           )\n                                       )\n                                 ),\n                             IMLN(IMSUB(COMPLEX(1,0),IMSQRT(IMDIV(COMPLEX(E10,E11),\n                                                                  COMPLEX(E13,E14)\n                                                                 )\n                                                           )\n                                       )\n                                 )\n                            )\n                      ),\n         \"\"\n        )","v":-0.34666290247071602},null," PHYSICAL LENGTH, l   feet ",null,null,100]
{"$rows_left_out":13}
{"sheet":"Supplement","index":3,"n_rows":401,"n_cols":48,"rows_kept":401,"cut":false,"hidden":false,"merged":[[0,27,1,37],[75,7,75,8],[76,7,76,8],[72,7,72,8],[57,7,57,8],[74,7,74,8],[15,6,15,8],[56,6,56,8],[43,7,43,8],[52,7,52,8],[53,7,53,8],[3,24,4,25],[55,7,55,8],[59,7,59,8],[60,7,60,8],[20,7,20,8],[193,15,193,16],[23,7,23,8],[71,7,71,8],[194,15,194,16],[54,7,54,8],[51,7,51,8],[30,7,30,8],[61,7,61,8],[62,7,62,8],[63,7,63,8],[64,7,64,8],[65,7,65,8],[94,7,94,8],[95,7,95,8],[66,7,66,8],[68,7,68,8],[47,7,47,8],[32,7,32,8],[31,7,31,8],[24,7,24,8],[44,7,44,8],[45,7,45,8],[46,7,46,8],[24,41,24,49],[14,41,14,49],[23,41,23,49],[20,41,20,49],[21,41,21,49],[22,41,22,49],[30,47,30,49],[28,40,29,49],[26,41,26,49],[27,41,27,49],[25,41,25,49],[4,41,5,48],[6,41,6,49],[7,41,7,49],[19,7,19,8],[19,41,19,49],[8,41,8,49],[9,41,9,49],[15,41,15,49],[10,41,10,49],[11,41,11,49],[12,41,12,49],[13,41,13,49],[16,41,16,49],[17,41,17,49],[18,41,18,49],[93,7,93,8],[78,7,78,8],[79,7,79,8],[196,8,197,12],[195,15,195,16],[82,6,82,8],[83,7,83,8],[90,7,90,8],[85,7,85,8],[86,7,86,8],[87,7,87,8],[88,7,88,8],[89,7,89,8],[91,7,91,8],[92,7,92,8],[196,15,196,16],[57,27,58,37],[69,7,69,8],[70,7,70,8],[67,7,67,8],[84,7,84,8],[58,7,58,8],[77,7,77,8],[73,7,73,8]]}
[null,null,null,null,null,null,null,null,null,null,null,null,null,null,null,null,null,null,null,null,null,null,null,null,null,null,null,"For Information Only: Applied Equations."]
[]
[]
[null,null,null,null,null,null,null,null,null,null,null,null,null,null,null,null,null,null,null,null,null,null,null,null,"Read Disclaimer"]
[null,null,null,null,null,null,null,null,null,null,null,null,null,null,null,null,null,null,null,null,null,null,null,null,null,null,null,null,null,null,null,null,null,null,null,null,null,null,null,null,null,"References"]
[]
[null,null,null,null,null,null,null,null,null,null,null,null,null,null,null,null,null,null,null,null,null,null,null,null,null,null,null,null,null,null,null,null,null,null,null,null,null,null,null,null,null,"William T. Joines, W. D. Palmer, Jennifer T. Bernhard, \"Microwave Transmission Line"]
[null,null,null,null,null,null,null,null,null,null,null,null,null,null,null,null,null,null,null,null,null,null,null,null,null,null,null,null,null,null,null,null,null,null,null,null,null,null,null,null,null,"Circuits.\" Artech House, Norwood, 2013."]
[null,null,null,null,null,null,null,null,null,null,null,null,null,null,null,null,null,null,null,null,null,null,null,null,null,null,null,null,null,null,null,null,null,null,null,null,null,null,null,null,null,"Dylan Williams, \"Traveling Waves and Power Waves,\" IEEE Microwave Magazine, November/December 2013, "]
[null,null,null,null,null,null,null,null,null,null,null,null,null,null,null,null,null,null,null,null,null,null,null,null,null,null,null,null,null,null,null,null,null,null,null,null,null,null,null,null,null,"pp. 38-45, November/December 2013. "]
[null,null,null,null,null,null,null,null,null,null,null,null,null,null,null,null,null,null,null,null,null,null,null,null,null,null,null,null,null,null,null,null,null,null,null,null,null,null,null,null,null,"Shuhei Amakawa, \"Scattered Reflections on Scattering Parameters - Demystifying"]
[null,null,null,null,null,null,null,null,null,null,null,null,null,null,null,null,null,null,null,null,null,null,null,null,null,null,null,null,null,null,null,null,null,null,null,null,null,null,null,null,null,"Complex-Referenced S Parameters,\" IEICE Trans. Electron.,Vol. E99-C, No. 10, Oct 2016."]
[null,null,null,null,null,null,null,null,null,null,null,null,null,null,null,null,null,null,null,null,null,null,null,null,null,null,null,null,null,null,null,null,null,null,null,null,null,null,null,null,null,"Luitjens Popken, \"Das hartnäckige Mysterium der „Totalreflexion“ auf HF-Leitungen,\""]
[null,null,null,null,null,null,null,null,null,null,null,null,null,null,null,null,null,null,null,null,null,null,null,null,null,null,null,null,null,null,null,null,null,null,null,null,null,null,null,null,null,"(in German), Issue 1, Rev. 2, May 2021. "]
[null,null,null,null,null,null,null,null,null,null,null,null,null,null,null,null,null,null,null,null,null,null,null,null,null,null,null,null,null,null,null,null,null,null,null,null,null,null,null,null,null,"Jim Stiles, \"Matching with lumped elements,\" Department of Electrical Engineering and"]
[null,null,null,null,null,null,"Worksheet \"TL-System\" Support",null,null,null,null,null,null,null,null,null,null,null,null,null,null,null,null,null,null,null,null,null,null,null,null,null,null,null,null,null,null,null,null,null,null,"Computer Science. EECS 723 - Microwave Engineering - course handout, Univ. Kansas."]
[null,null,null,null,null,null," ELECTRICAL LENGTH     (length/λ) ",null,null,null,null,null,null,null,null,null,null,null,null,null,null,null,null,null,null,null,null,null,null,null,null,null,null,null,null,null,null,null,null,null,null,"Train your Critical Reading:"]
[null,null,null,null,null,null," ELECTRICAL LENGTH            deg ",null,null,null,null,null,null,null,null,null,null,null,null,null,null,null,null,null,null,null,null,null,null,null,null,null,null,null,null,null,null,null,null,null,null,"M. Walter Maxwell, \"Another Look at Reflections,\" QST Magazine, ARRL, Part 1,"]
[null,null,null,null,null,null," PHYSICAL LENGTH,  l           m  ",null,null,null,null,null,null,null,null,null,null,null,null,null,null,null,null,null,null,null,null,null,null,null,null,null,null,null,null,null,null,null,null,null,null,"April 1973, pp. 35-41; Part 2, June 1973, pp. 20-27; Part 3, Aug. 1973, pp. 36-43;"]
[null,null,null,null,null,null," PHYSICAL LENGTH,  l         feet ","TL Physical Length:",null,null,null,null,null,null,null,null,null,null,null,null,null,null,null,null,null,null,null,null,null,null,null,null,null,null,null,null,null,null,null,null,null,"Part 4, Oct. 1973, pp. 22-29; Part 5, April 1974, pp. 26-29, 160-165;  Part 6, Dec. 1974,"]
{"$rows_left_out":381}